[Solved] Compilation fails on Debian.

Having trouble installing or compiling FreeCAD? Get help here.
fcaduser
Posts: 281
Joined: Wed Feb 19, 2014 6:53 pm
Location: Near Paris, France

Re: Compilation fails on Debian.

Postby fcaduser » Wed Aug 21, 2019 4:34 pm

Last report.
[ 0%] Built target Driver
[ 1%] Built target SMDS
[ 1%] Built target SMESHDS
[ 1%] Built target DriverUNV
[ 2%] Built target DriverDAT
[ 2%] Built target DriverSTL
[ 4%] Built target SMESH
[ 4%] Built target MEFISTO2
[ 6%] Built target StdMeshers
[ 9%] Built target FreeCADBase
[ 9%] Generating version_check
git
/home/mainuser/softwares/freecad_source/built_2019-08-21/src/Build/Version.h.out written
[ 9%] Generating Version.h
[ 9%] Built target fc_version
[ 12%] Built target FreeCADApp
[ 27%] Built target FreeCADGui
[ 27%] Built target FreeCADMain
[ 27%] Built target FreeCADGuiPy
[ 27%] Built target FreeCADMainCmd
[ 27%] Built target FreeCADMainPy
[ 27%] Built target Points
[ 28%] Built target PointsGui
[ 28%] Built target Complete
[ 28%] Built target CompleteGui
[ 29%] Built target Test
[ 29%] Built target QtUnitGui
[ 29%] Built target ImageScripts
[ 29%] Built target Image
[ 30%] Built target ImageGui
[ 30%] Built target MeshScripts
[ 34%] Built target Mesh
[ 35%] Built target MeshGui
[ 36%] Built target PartScripts
[ 36%] Building CXX object src/Mod/Part/App/CMakeFiles/Part.dir/Geometry.cpp.o
/home/mainuser/softwares/freecad_source/src/Mod/Part/App/Geometry.cpp: In member function ‘virtual void Part::Geometry::Save(Base::Writer&) const’:
/home/mainuser/softwares/freecad_source/src/Mod/Part/App/Geometry.cpp:210:103: error: ‘endl’ was not declared in this scope
writer.Stream() << writer.ind() << "<GeoExtensions count=\"" << extensions.size() << "\">" << endl;
^~~~
/home/mainuser/softwares/freecad_source/src/Mod/Part/App/Geometry.cpp:210:103: note: suggested alternatives:
In file included from /usr/include/c++/6/iostream:39:0,
from /home/mainuser/softwares/occt-0be1173/include/opencascade/Standard_Stream.hxx:20,
from /home/mainuser/softwares/occt-0be1173/include/opencascade/Standard_OStream.hxx:19,
from /home/mainuser/softwares/occt-0be1173/include/opencascade/Standard_ExtCharacter.hxx:28,
from /home/mainuser/softwares/occt-0be1173/include/opencascade/Standard_PrimitiveTypes.hxx:27,
from /home/mainuser/softwares/occt-0be1173/include/opencascade/Standard_Transient.hxx:20,
from /home/mainuser/softwares/occt-0be1173/include/opencascade/Standard.hxx:91,
from /home/mainuser/softwares/occt-0be1173/include/opencascade/BRepBuilderAPI_MakeEdge.hxx:20,
from /home/mainuser/softwares/freecad_source/src/Mod/Part/App/Geometry.cpp:26:
/usr/include/c++/6/ostream:590:5: note: ‘std::endl’
endl(basic_ostream<_CharT, _Traits>& __os)
^~~~
/usr/include/c++/6/ostream:590:5: note: ‘std::endl’
/usr/include/c++/6/ostream:590:5: note: ‘std::endl’
/home/mainuser/softwares/freecad_source/src/Mod/Part/App/Geometry.cpp:221:84: error: ‘endl’ was not declared in this scope
writer.Stream() << writer.ind() << "<Construction value=\"" << c << "\"/>" << endl;
^~~~
/home/mainuser/softwares/freecad_source/src/Mod/Part/App/Geometry.cpp:221:84: note: suggested alternatives:
In file included from /usr/include/c++/6/iostream:39:0,
from /home/mainuser/softwares/occt-0be1173/include/opencascade/Standard_Stream.hxx:20,
from /home/mainuser/softwares/occt-0be1173/include/opencascade/Standard_OStream.hxx:19,
from /home/mainuser/softwares/occt-0be1173/include/opencascade/Standard_ExtCharacter.hxx:28,
from /home/mainuser/softwares/occt-0be1173/include/opencascade/Standard_PrimitiveTypes.hxx:27,
from /home/mainuser/softwares/occt-0be1173/include/opencascade/Standard_Transient.hxx:20,
from /home/mainuser/softwares/occt-0be1173/include/opencascade/Standard.hxx:91,
from /home/mainuser/softwares/occt-0be1173/include/opencascade/BRepBuilderAPI_MakeEdge.hxx:20,
from /home/mainuser/softwares/freecad_source/src/Mod/Part/App/Geometry.cpp:26:
/usr/include/c++/6/ostream:590:5: note: ‘std::endl’
endl(basic_ostream<_CharT, _Traits>& __os)
^~~~
/usr/include/c++/6/ostream:590:5: note: ‘std::endl’
/usr/include/c++/6/ostream:590:5: note: ‘std::endl’
/home/mainuser/softwares/freecad_source/src/Mod/Part/App/Geometry.cpp: In member function ‘virtual void Part::GeomPoint::Save(Base::Writer&) const’:
/home/mainuser/softwares/freecad_source/src/Mod/Part/App/Geometry.cpp:457:24: error: ‘endl’ was not declared in this scope
"\"/>" << endl;
^~~~
/home/mainuser/softwares/freecad_source/src/Mod/Part/App/Geometry.cpp:457:24: note: suggested alternatives:
In file included from /usr/include/c++/6/iostream:39:0,
from /home/mainuser/softwares/occt-0be1173/include/opencascade/Standard_Stream.hxx:20,
from /home/mainuser/softwares/occt-0be1173/include/opencascade/Standard_OStream.hxx:19,
from /home/mainuser/softwares/occt-0be1173/include/opencascade/Standard_ExtCharacter.hxx:28,
from /home/mainuser/softwares/occt-0be1173/include/opencascade/Standard_PrimitiveTypes.hxx:27,
from /home/mainuser/softwares/occt-0be1173/include/opencascade/Standard_Transient.hxx:20,
from /home/mainuser/softwares/occt-0be1173/include/opencascade/Standard.hxx:91,
from /home/mainuser/softwares/occt-0be1173/include/opencascade/BRepBuilderAPI_MakeEdge.hxx:20,
from /home/mainuser/softwares/freecad_source/src/Mod/Part/App/Geometry.cpp:26:
/usr/include/c++/6/ostream:590:5: note: ‘std::endl’
endl(basic_ostream<_CharT, _Traits>& __os)
^~~~
/usr/include/c++/6/ostream:590:5: note: ‘std::endl’
/usr/include/c++/6/ostream:590:5: note: ‘std::endl’
/home/mainuser/softwares/freecad_source/src/Mod/Part/App/Geometry.cpp: In member function ‘virtual void Part::GeomBezierCurve::Save(Base::Writer&) const’:
/home/mainuser/softwares/freecad_source/src/Mod/Part/App/Geometry.cpp:927:23: error: ‘endl’ was not declared in this scope
"\">" << endl;
^~~~
/home/mainuser/softwares/freecad_source/src/Mod/Part/App/Geometry.cpp:927:23: note: suggested alternatives:
In file included from /usr/include/c++/6/iostream:39:0,
from /home/mainuser/softwares/occt-0be1173/include/opencascade/Standard_Stream.hxx:20,
from /home/mainuser/softwares/occt-0be1173/include/opencascade/Standard_OStream.hxx:19,
from /home/mainuser/softwares/occt-0be1173/include/opencascade/Standard_ExtCharacter.hxx:28,
from /home/mainuser/softwares/occt-0be1173/include/opencascade/Standard_PrimitiveTypes.hxx:27,
from /home/mainuser/softwares/occt-0be1173/include/opencascade/Standard_Transient.hxx:20,
from /home/mainuser/softwares/occt-0be1173/include/opencascade/Standard.hxx:91,
from /home/mainuser/softwares/occt-0be1173/include/opencascade/BRepBuilderAPI_MakeEdge.hxx:20,
from /home/mainuser/softwares/freecad_source/src/Mod/Part/App/Geometry.cpp:26:
/usr/include/c++/6/ostream:590:5: note: ‘std::endl’
endl(basic_ostream<_CharT, _Traits>& __os)
^~~~
/usr/include/c++/6/ostream:590:5: note: ‘std::endl’
/usr/include/c++/6/ostream:590:5: note: ‘std::endl’
/home/mainuser/softwares/freecad_source/src/Mod/Part/App/Geometry.cpp: In member function ‘virtual void Part::GeomBSplineCurve::Save(Base::Writer&) const’:
/home/mainuser/softwares/freecad_source/src/Mod/Part/App/Geometry.cpp:1404:23: error: ‘endl’ was not declared in this scope
"\">" << endl;
^~~~
/home/mainuser/softwares/freecad_source/src/Mod/Part/App/Geometry.cpp:1404:23: note: suggested alternatives:
In file included from /usr/include/c++/6/iostream:39:0,
from /home/mainuser/softwares/occt-0be1173/include/opencascade/Standard_Stream.hxx:20,
from /home/mainuser/softwares/occt-0be1173/include/opencascade/Standard_OStream.hxx:19,
from /home/mainuser/softwares/occt-0be1173/include/opencascade/Standard_ExtCharacter.hxx:28,
from /home/mainuser/softwares/occt-0be1173/include/opencascade/Standard_PrimitiveTypes.hxx:27,
from /home/mainuser/softwares/occt-0be1173/include/opencascade/Standard_Transient.hxx:20,
from /home/mainuser/softwares/occt-0be1173/include/opencascade/Standard.hxx:91,
from /home/mainuser/softwares/occt-0be1173/include/opencascade/BRepBuilderAPI_MakeEdge.hxx:20,
from /home/mainuser/softwares/freecad_source/src/Mod/Part/App/Geometry.cpp:26:
/usr/include/c++/6/ostream:590:5: note: ‘std::endl’
endl(basic_ostream<_CharT, _Traits>& __os)
^~~~
/usr/include/c++/6/ostream:590:5: note: ‘std::endl’
/usr/include/c++/6/ostream:590:5: note: ‘std::endl’
/home/mainuser/softwares/freecad_source/src/Mod/Part/App/Geometry.cpp: In member function ‘virtual void Part::GeomCircle::Save(Base::Writer&) const’:
/home/mainuser/softwares/freecad_source/src/Mod/Part/App/Geometry.cpp:2037:24: error: ‘endl’ was not declared in this scope
"\"/>" << endl;
^~~~
/home/mainuser/softwares/freecad_source/src/Mod/Part/App/Geometry.cpp:2037:24: note: suggested alternatives:
In file included from /usr/include/c++/6/iostream:39:0,
from /home/mainuser/softwares/occt-0be1173/include/opencascade/Standard_Stream.hxx:20,
from /home/mainuser/softwares/occt-0be1173/include/opencascade/Standard_OStream.hxx:19,
from /home/mainuser/softwares/occt-0be1173/include/opencascade/Standard_ExtCharacter.hxx:28,
from /home/mainuser/softwares/occt-0be1173/include/opencascade/Standard_PrimitiveTypes.hxx:27,
from /home/mainuser/softwares/occt-0be1173/include/opencascade/Standard_Transient.hxx:20,
from /home/mainuser/softwares/occt-0be1173/include/opencascade/Standard.hxx:91,
from /home/mainuser/softwares/occt-0be1173/include/opencascade/BRepBuilderAPI_MakeEdge.hxx:20,
from /home/mainuser/softwares/freecad_source/src/Mod/Part/App/Geometry.cpp:26:
/usr/include/c++/6/ostream:590:5: note: ‘std::endl’
endl(basic_ostream<_CharT, _Traits>& __os)
^~~~
/usr/include/c++/6/ostream:590:5: note: ‘std::endl’
/usr/include/c++/6/ostream:590:5: note: ‘std::endl’
/home/mainuser/softwares/freecad_source/src/Mod/Part/App/Geometry.cpp: In member function ‘virtual void Part::GeomArcOfCircle::Save(Base::Writer&) const’:
/home/mainuser/softwares/freecad_source/src/Mod/Part/App/Geometry.cpp:2266:24: error: ‘endl’ was not declared in this scope
"\"/>" << endl;
^~~~
/home/mainuser/softwares/freecad_source/src/Mod/Part/App/Geometry.cpp:2266:24: note: suggested alternatives:
In file included from /usr/include/c++/6/iostream:39:0,
from /home/mainuser/softwares/occt-0be1173/include/opencascade/Standard_Stream.hxx:20,
from /home/mainuser/softwares/occt-0be1173/include/opencascade/Standard_OStream.hxx:19,
from /home/mainuser/softwares/occt-0be1173/include/opencascade/Standard_ExtCharacter.hxx:28,
from /home/mainuser/softwares/occt-0be1173/include/opencascade/Standard_PrimitiveTypes.hxx:27,
from /home/mainuser/softwares/occt-0be1173/include/opencascade/Standard_Transient.hxx:20,
from /home/mainuser/softwares/occt-0be1173/include/opencascade/Standard.hxx:91,
from /home/mainuser/softwares/occt-0be1173/include/opencascade/BRepBuilderAPI_MakeEdge.hxx:20,
from /home/mainuser/softwares/freecad_source/src/Mod/Part/App/Geometry.cpp:26:
/usr/include/c++/6/ostream:590:5: note: ‘std::endl’
endl(basic_ostream<_CharT, _Traits>& __os)
^~~~
/usr/include/c++/6/ostream:590:5: note: ‘std::endl’
/usr/include/c++/6/ostream:590:5: note: ‘std::endl’
/home/mainuser/softwares/freecad_source/src/Mod/Part/App/Geometry.cpp: In member function ‘virtual void Part::GeomEllipse::Save(Base::Writer&) const’:
/home/mainuser/softwares/freecad_source/src/Mod/Part/App/Geometry.cpp:2517:24: error: ‘endl’ was not declared in this scope
<< "/>" << endl;
^~~~
/home/mainuser/softwares/freecad_source/src/Mod/Part/App/Geometry.cpp:2517:24: note: suggested alternatives:
In file included from /usr/include/c++/6/iostream:39:0,
from /home/mainuser/softwares/occt-0be1173/include/opencascade/Standard_Stream.hxx:20,
from /home/mainuser/softwares/occt-0be1173/include/opencascade/Standard_OStream.hxx:19,
from /home/mainuser/softwares/occt-0be1173/include/opencascade/Standard_ExtCharacter.hxx:28,
from /home/mainuser/softwares/occt-0be1173/include/opencascade/Standard_PrimitiveTypes.hxx:27,
from /home/mainuser/softwares/occt-0be1173/include/opencascade/Standard_Transient.hxx:20,
from /home/mainuser/softwares/occt-0be1173/include/opencascade/Standard.hxx:91,
from /home/mainuser/softwares/occt-0be1173/include/opencascade/BRepBuilderAPI_MakeEdge.hxx:20,
from /home/mainuser/softwares/freecad_source/src/Mod/Part/App/Geometry.cpp:26:
/usr/include/c++/6/ostream:590:5: note: ‘std::endl’
endl(basic_ostream<_CharT, _Traits>& __os)
^~~~
/usr/include/c++/6/ostream:590:5: note: ‘std::endl’
/usr/include/c++/6/ostream:590:5: note: ‘std::endl’
/home/mainuser/softwares/freecad_source/src/Mod/Part/App/Geometry.cpp: In member function ‘virtual void Part::GeomArcOfEllipse::Save(Base::Writer&) const’:
/home/mainuser/softwares/freecad_source/src/Mod/Part/App/Geometry.cpp:2787:24: error: ‘endl’ was not declared in this scope
<< "/>" << endl;
^~~~
/home/mainuser/softwares/freecad_source/src/Mod/Part/App/Geometry.cpp:2787:24: note: suggested alternatives:
In file included from /usr/include/c++/6/iostream:39:0,
from /home/mainuser/softwares/occt-0be1173/include/opencascade/Standard_Stream.hxx:20,
from /home/mainuser/softwares/occt-0be1173/include/opencascade/Standard_OStream.hxx:19,
from /home/mainuser/softwares/occt-0be1173/include/opencascade/Standard_ExtCharacter.hxx:28,
from /home/mainuser/softwares/occt-0be1173/include/opencascade/Standard_PrimitiveTypes.hxx:27,
from /home/mainuser/softwares/occt-0be1173/include/opencascade/Standard_Transient.hxx:20,
from /home/mainuser/softwares/occt-0be1173/include/opencascade/Standard.hxx:91,
from /home/mainuser/softwares/occt-0be1173/include/opencascade/BRepBuilderAPI_MakeEdge.hxx:20,
from /home/mainuser/softwares/freecad_source/src/Mod/Part/App/Geometry.cpp:26:
/usr/include/c++/6/ostream:590:5: note: ‘std::endl’
endl(basic_ostream<_CharT, _Traits>& __os)
^~~~
/usr/include/c++/6/ostream:590:5: note: ‘std::endl’
/usr/include/c++/6/ostream:590:5: note: ‘std::endl’
/home/mainuser/softwares/freecad_source/src/Mod/Part/App/Geometry.cpp: In member function ‘virtual void Part::GeomHyperbola::Save(Base::Writer&) const’:
/home/mainuser/softwares/freecad_source/src/Mod/Part/App/Geometry.cpp:2960:24: error: ‘endl’ was not declared in this scope
<< "/>" << endl;
^~~~
/home/mainuser/softwares/freecad_source/src/Mod/Part/App/Geometry.cpp:2960:24: note: suggested alternatives:
In file included from /usr/include/c++/6/iostream:39:0,
from /home/mainuser/softwares/occt-0be1173/include/opencascade/Standard_Stream.hxx:20,
from /home/mainuser/softwares/occt-0be1173/include/opencascade/Standard_OStream.hxx:19,
from /home/mainuser/softwares/occt-0be1173/include/opencascade/Standard_ExtCharacter.hxx:28,
from /home/mainuser/softwares/occt-0be1173/include/opencascade/Standard_PrimitiveTypes.hxx:27,
from /home/mainuser/softwares/occt-0be1173/include/opencascade/Standard_Transient.hxx:20,
from /home/mainuser/softwares/occt-0be1173/include/opencascade/Standard.hxx:91,
from /home/mainuser/softwares/occt-0be1173/include/opencascade/BRepBuilderAPI_MakeEdge.hxx:20,
from /home/mainuser/softwares/freecad_source/src/Mod/Part/App/Geometry.cpp:26:
/usr/include/c++/6/ostream:590:5: note: ‘std::endl’
endl(basic_ostream<_CharT, _Traits>& __os)
^~~~
/usr/include/c++/6/ostream:590:5: note: ‘std::endl’
/usr/include/c++/6/ostream:590:5: note: ‘std::endl’
/home/mainuser/softwares/freecad_source/src/Mod/Part/App/Geometry.cpp: In member function ‘virtual void Part::GeomArcOfHyperbola::Save(Base::Writer&) const’:
/home/mainuser/softwares/freecad_source/src/Mod/Part/App/Geometry.cpp:3217:24: error: ‘endl’ was not declared in this scope
<< "/>" << endl;
^~~~
/home/mainuser/softwares/freecad_source/src/Mod/Part/App/Geometry.cpp:3217:24: note: suggested alternatives:
In file included from /usr/include/c++/6/iostream:39:0,
from /home/mainuser/softwares/occt-0be1173/include/opencascade/Standard_Stream.hxx:20,
from /home/mainuser/softwares/occt-0be1173/include/opencascade/Standard_OStream.hxx:19,
from /home/mainuser/softwares/occt-0be1173/include/opencascade/Standard_ExtCharacter.hxx:28,
from /home/mainuser/softwares/occt-0be1173/include/opencascade/Standard_PrimitiveTypes.hxx:27,
from /home/mainuser/softwares/occt-0be1173/include/opencascade/Standard_Transient.hxx:20,
from /home/mainuser/softwares/occt-0be1173/include/opencascade/Standard.hxx:91,
from /home/mainuser/softwares/occt-0be1173/include/opencascade/BRepBuilderAPI_MakeEdge.hxx:20,
from /home/mainuser/softwares/freecad_source/src/Mod/Part/App/Geometry.cpp:26:
/usr/include/c++/6/ostream:590:5: note: ‘std::endl’
endl(basic_ostream<_CharT, _Traits>& __os)
^~~~
/usr/include/c++/6/ostream:590:5: note: ‘std::endl’
/usr/include/c++/6/ostream:590:5: note: ‘std::endl’
/home/mainuser/softwares/freecad_source/src/Mod/Part/App/Geometry.cpp: In member function ‘virtual void Part::GeomParabola::Save(Base::Writer&) const’:
/home/mainuser/softwares/freecad_source/src/Mod/Part/App/Geometry.cpp:3370:24: error: ‘endl’ was not declared in this scope
<< "/>" << endl;
^~~~
/home/mainuser/softwares/freecad_source/src/Mod/Part/App/Geometry.cpp:3370:24: note: suggested alternatives:
In file included from /usr/include/c++/6/iostream:39:0,
from /home/mainuser/softwares/occt-0be1173/include/opencascade/Standard_Stream.hxx:20,
from /home/mainuser/softwares/occt-0be1173/include/opencascade/Standard_OStream.hxx:19,
from /home/mainuser/softwares/occt-0be1173/include/opencascade/Standard_ExtCharacter.hxx:28,
from /home/mainuser/softwares/occt-0be1173/include/opencascade/Standard_PrimitiveTypes.hxx:27,
from /home/mainuser/softwares/occt-0be1173/include/opencascade/Standard_Transient.hxx:20,
from /home/mainuser/softwares/occt-0be1173/include/opencascade/Standard.hxx:91,
from /home/mainuser/softwares/occt-0be1173/include/opencascade/BRepBuilderAPI_MakeEdge.hxx:20,
from /home/mainuser/softwares/freecad_source/src/Mod/Part/App/Geometry.cpp:26:
/usr/include/c++/6/ostream:590:5: note: ‘std::endl’
endl(basic_ostream<_CharT, _Traits>& __os)
^~~~
/usr/include/c++/6/ostream:590:5: note: ‘std::endl’
/usr/include/c++/6/ostream:590:5: note: ‘std::endl’
/home/mainuser/softwares/freecad_source/src/Mod/Part/App/Geometry.cpp: In member function ‘virtual void Part::GeomArcOfParabola::Save(Base::Writer&) const’:
/home/mainuser/softwares/freecad_source/src/Mod/Part/App/Geometry.cpp:3570:24: error: ‘endl’ was not declared in this scope
<< "/>" << endl;
^~~~
/home/mainuser/softwares/freecad_source/src/Mod/Part/App/Geometry.cpp:3570:24: note: suggested alternatives:
In file included from /usr/include/c++/6/iostream:39:0,
from /home/mainuser/softwares/occt-0be1173/include/opencascade/Standard_Stream.hxx:20,
from /home/mainuser/softwares/occt-0be1173/include/opencascade/Standard_OStream.hxx:19,
from /home/mainuser/softwares/occt-0be1173/include/opencascade/Standard_ExtCharacter.hxx:28,
from /home/mainuser/softwares/occt-0be1173/include/opencascade/Standard_PrimitiveTypes.hxx:27,
from /home/mainuser/softwares/occt-0be1173/include/opencascade/Standard_Transient.hxx:20,
from /home/mainuser/softwares/occt-0be1173/include/opencascade/Standard.hxx:91,
from /home/mainuser/softwares/occt-0be1173/include/opencascade/BRepBuilderAPI_MakeEdge.hxx:20,
from /home/mainuser/softwares/freecad_source/src/Mod/Part/App/Geometry.cpp:26:
/usr/include/c++/6/ostream:590:5: note: ‘std::endl’
endl(basic_ostream<_CharT, _Traits>& __os)
^~~~
/usr/include/c++/6/ostream:590:5: note: ‘std::endl’
/usr/include/c++/6/ostream:590:5: note: ‘std::endl’
/home/mainuser/softwares/freecad_source/src/Mod/Part/App/Geometry.cpp: In member function ‘virtual void Part::GeomLine::Save(Base::Writer&) const’:
/home/mainuser/softwares/freecad_source/src/Mod/Part/App/Geometry.cpp:3715:24: error: ‘endl’ was not declared in this scope
"\"/>" << endl;
^~~~
/home/mainuser/softwares/freecad_source/src/Mod/Part/App/Geometry.cpp:3715:24: note: suggested alternatives:
In file included from /usr/include/c++/6/iostream:39:0,
from /home/mainuser/softwares/occt-0be1173/include/opencascade/Standard_Stream.hxx:20,
from /home/mainuser/softwares/occt-0be1173/include/opencascade/Standard_OStream.hxx:19,
from /home/mainuser/softwares/occt-0be1173/include/opencascade/Standard_ExtCharacter.hxx:28,
from /home/mainuser/softwares/occt-0be1173/include/opencascade/Standard_PrimitiveTypes.hxx:27,
from /home/mainuser/softwares/occt-0be1173/include/opencascade/Standard_Transient.hxx:20,
from /home/mainuser/softwares/occt-0be1173/include/opencascade/Standard.hxx:91,
from /home/mainuser/softwares/occt-0be1173/include/opencascade/BRepBuilderAPI_MakeEdge.hxx:20,
from /home/mainuser/softwares/freecad_source/src/Mod/Part/App/Geometry.cpp:26:
/usr/include/c++/6/ostream:590:5: note: ‘std::endl’
endl(basic_ostream<_CharT, _Traits>& __os)
^~~~
/usr/include/c++/6/ostream:590:5: note: ‘std::endl’
/usr/include/c++/6/ostream:590:5: note: ‘std::endl’
/home/mainuser/softwares/freecad_source/src/Mod/Part/App/Geometry.cpp: In member function ‘virtual void Part::GeomLineSegment::Save(Base::Writer&) const’:
/home/mainuser/softwares/freecad_source/src/Mod/Part/App/Geometry.cpp:3856:24: error: ‘endl’ was not declared in this scope
"\"/>" << endl;
^~~~
/home/mainuser/softwares/freecad_source/src/Mod/Part/App/Geometry.cpp:3856:24: note: suggested alternatives:
In file included from /usr/include/c++/6/iostream:39:0,
from /home/mainuser/softwares/occt-0be1173/include/opencascade/Standard_Stream.hxx:20,
from /home/mainuser/softwares/occt-0be1173/include/opencascade/Standard_OStream.hxx:19,
from /home/mainuser/softwares/occt-0be1173/include/opencascade/Standard_ExtCharacter.hxx:28,
from /home/mainuser/softwares/occt-0be1173/include/opencascade/Standard_PrimitiveTypes.hxx:27,
from /home/mainuser/softwares/occt-0be1173/include/opencascade/Standard_Transient.hxx:20,
from /home/mainuser/softwares/occt-0be1173/include/opencascade/Standard.hxx:91,
from /home/mainuser/softwares/occt-0be1173/include/opencascade/BRepBuilderAPI_MakeEdge.hxx:20,
from /home/mainuser/softwares/freecad_source/src/Mod/Part/App/Geometry.cpp:26:
/usr/include/c++/6/ostream:590:5: note: ‘std::endl’
endl(basic_ostream<_CharT, _Traits>& __os)
^~~~
/usr/include/c++/6/ostream:590:5: note: ‘std::endl’
/usr/include/c++/6/ostream:590:5: note: ‘std::endl’
src/Mod/Part/App/CMakeFiles/Part.dir/build.make:3413 : la recette pour la cible « src/Mod/Part/App/CMakeFiles/Part.dir/Geometry.cpp.o » a échouée
make[2]: *** [src/Mod/Part/App/CMakeFiles/Part.dir/Geometry.cpp.o] Erreur 1
CMakeFiles/Makefile2:1877 : la recette pour la cible « src/Mod/Part/App/CMakeFiles/Part.dir/all » a échouée
make[1]: *** [src/Mod/Part/App/CMakeFiles/Part.dir/all] Erreur 2
Makefile:127 : la recette pour la cible « all » a échouée
make: *** [all] Erreur 2
wmayer
Site Admin
Posts: 15756
Joined: Thu Feb 19, 2009 10:32 am

Re: Compilation fails on Debian.

Postby wmayer » Wed Aug 21, 2019 5:23 pm

Next.
fcaduser
Posts: 281
Joined: Wed Feb 19, 2014 6:53 pm
Location: Near Paris, France

Re: Compilation fails on Debian.

Postby fcaduser » Wed Aug 21, 2019 5:59 pm

Testing.
Jee-Bee
Posts: 2012
Joined: Tue Jun 16, 2015 10:32 am
Location: Netherlands

Re: Compilation fails on Debian.

Postby Jee-Bee » Wed Aug 21, 2019 6:19 pm

please use code brackets (looks like </>)
fcaduser
Posts: 281
Joined: Wed Feb 19, 2014 6:53 pm
Location: Near Paris, France

Re: Compilation fails on Debian.

Postby fcaduser » Wed Aug 21, 2019 8:08 pm

OK. I thought code was for insert *.{cpp,py,h, ... }
fcaduser
Posts: 281
Joined: Wed Feb 19, 2014 6:53 pm
Location: Near Paris, France

Re: Compilation fails on Debian.

Postby fcaduser » Wed Aug 21, 2019 8:16 pm

New one.

Code: Select all

[  0%] Built target Driver
[  1%] Built target SMDS
[  1%] Built target SMESHDS
[  1%] Built target DriverUNV
[  2%] Built target DriverDAT
[  2%] Built target DriverSTL
[  4%] Built target SMESH
[  4%] Built target MEFISTO2
[  6%] Built target StdMeshers
[  9%] Built target FreeCADBase
[  9%] Generating version_check
git
/home/mainuser/softwares/freecad_source/built_2019-08-21/src/Build/Version.h.out written
[  9%] Generating Version.h
[  9%] Built target fc_version
[ 12%] Built target FreeCADApp
[ 27%] Built target FreeCADGui
[ 27%] Built target FreeCADMain
[ 27%] Built target FreeCADGuiPy
[ 27%] Built target FreeCADMainCmd
[ 27%] Built target FreeCADMainPy
[ 27%] Built target Points
[ 28%] Built target PointsGui
[ 28%] Built target Complete
[ 28%] Built target CompleteGui
[ 29%] Built target Test
[ 29%] Built target QtUnitGui
[ 29%] Built target ImageScripts
[ 29%] Built target Image
[ 30%] Built target ImageGui
[ 30%] Built target MeshScripts
[ 34%] Built target Mesh
[ 35%] Built target MeshGui
[ 36%] Built target PartScripts
[ 36%] Building CXX object src/Mod/Part/App/CMakeFiles/Part.dir/Geometry2d.cpp.o
/home/mainuser/softwares/freecad_source/src/Mod/Part/App/Geometry2d.cpp: In member function ‘virtual void Part::Geom2dPoint::Save(Base::Writer&) const’:
/home/mainuser/softwares/freecad_source/src/Mod/Part/App/Geometry2d.cpp:186:20: error: ‘endl’ was not declared in this scope
         << "/>" << endl;
                    ^~~~
/home/mainuser/softwares/freecad_source/src/Mod/Part/App/Geometry2d.cpp:186:20: note: suggested alternatives:
In file included from /usr/include/c++/6/iostream:39:0,
                 from /home/mainuser/softwares/occt-0be1173/include/opencascade/Standard_Stream.hxx:20,
                 from /home/mainuser/softwares/occt-0be1173/include/opencascade/Standard_OStream.hxx:19,
                 from /home/mainuser/softwares/occt-0be1173/include/opencascade/Standard_ExtCharacter.hxx:28,
                 from /home/mainuser/softwares/occt-0be1173/include/opencascade/Standard_PrimitiveTypes.hxx:27,
                 from /home/mainuser/softwares/occt-0be1173/include/opencascade/Standard_Transient.hxx:20,
                 from /home/mainuser/softwares/occt-0be1173/include/opencascade/Standard.hxx:91,
                 from /home/mainuser/softwares/occt-0be1173/include/opencascade/BRepBuilderAPI_MakeEdge2d.hxx:20,
                 from /home/mainuser/softwares/freecad_source/src/Mod/Part/App/Geometry2d.cpp:26:
/usr/include/c++/6/ostream:590:5: note:   ‘std::endl’
     endl(basic_ostream<_CharT, _Traits>& __os)
     ^~~~
/usr/include/c++/6/ostream:590:5: note:   ‘std::endl’
/usr/include/c++/6/ostream:590:5: note:   ‘std::endl’
/home/mainuser/softwares/freecad_source/src/Mod/Part/App/Geometry2d.cpp: In member function ‘virtual void Part::Geom2dCircle::Save(Base::Writer&) const’:
/home/mainuser/softwares/freecad_source/src/Mod/Part/App/Geometry2d.cpp:878:20: error: ‘endl’ was not declared in this scope
         << "/>" << endl;
                    ^~~~
/home/mainuser/softwares/freecad_source/src/Mod/Part/App/Geometry2d.cpp:878:20: note: suggested alternatives:
In file included from /usr/include/c++/6/iostream:39:0,
                 from /home/mainuser/softwares/occt-0be1173/include/opencascade/Standard_Stream.hxx:20,
                 from /home/mainuser/softwares/occt-0be1173/include/opencascade/Standard_OStream.hxx:19,
                 from /home/mainuser/softwares/occt-0be1173/include/opencascade/Standard_ExtCharacter.hxx:28,
                 from /home/mainuser/softwares/occt-0be1173/include/opencascade/Standard_PrimitiveTypes.hxx:27,
                 from /home/mainuser/softwares/occt-0be1173/include/opencascade/Standard_Transient.hxx:20,
                 from /home/mainuser/softwares/occt-0be1173/include/opencascade/Standard.hxx:91,
                 from /home/mainuser/softwares/occt-0be1173/include/opencascade/BRepBuilderAPI_MakeEdge2d.hxx:20,
                 from /home/mainuser/softwares/freecad_source/src/Mod/Part/App/Geometry2d.cpp:26:
/usr/include/c++/6/ostream:590:5: note:   ‘std::endl’
     endl(basic_ostream<_CharT, _Traits>& __os)
     ^~~~
/usr/include/c++/6/ostream:590:5: note:   ‘std::endl’
/usr/include/c++/6/ostream:590:5: note:   ‘std::endl’
/home/mainuser/softwares/freecad_source/src/Mod/Part/App/Geometry2d.cpp: In member function ‘virtual void Part::Geom2dArcOfCircle::Save(Base::Writer&) const’:
/home/mainuser/softwares/freecad_source/src/Mod/Part/App/Geometry2d.cpp:993:20: error: ‘endl’ was not declared in this scope
         << "/>" << endl;
                    ^~~~
/home/mainuser/softwares/freecad_source/src/Mod/Part/App/Geometry2d.cpp:993:20: note: suggested alternatives:
In file included from /usr/include/c++/6/iostream:39:0,
                 from /home/mainuser/softwares/occt-0be1173/include/opencascade/Standard_Stream.hxx:20,
                 from /home/mainuser/softwares/occt-0be1173/include/opencascade/Standard_OStream.hxx:19,
                 from /home/mainuser/softwares/occt-0be1173/include/opencascade/Standard_ExtCharacter.hxx:28,
                 from /home/mainuser/softwares/occt-0be1173/include/opencascade/Standard_PrimitiveTypes.hxx:27,
                 from /home/mainuser/softwares/occt-0be1173/include/opencascade/Standard_Transient.hxx:20,
                 from /home/mainuser/softwares/occt-0be1173/include/opencascade/Standard.hxx:91,
                 from /home/mainuser/softwares/occt-0be1173/include/opencascade/BRepBuilderAPI_MakeEdge2d.hxx:20,
                 from /home/mainuser/softwares/freecad_source/src/Mod/Part/App/Geometry2d.cpp:26:
/usr/include/c++/6/ostream:590:5: note:   ‘std::endl’
     endl(basic_ostream<_CharT, _Traits>& __os)
     ^~~~
/usr/include/c++/6/ostream:590:5: note:   ‘std::endl’
/usr/include/c++/6/ostream:590:5: note:   ‘std::endl’
/home/mainuser/softwares/freecad_source/src/Mod/Part/App/Geometry2d.cpp: In member function ‘virtual void Part::Geom2dEllipse::Save(Base::Writer&) const’:
/home/mainuser/softwares/freecad_source/src/Mod/Part/App/Geometry2d.cpp:1155:20: error: ‘endl’ was not declared in this scope
         << "/>" << endl;
                    ^~~~
/home/mainuser/softwares/freecad_source/src/Mod/Part/App/Geometry2d.cpp:1155:20: note: suggested alternatives:
In file included from /usr/include/c++/6/iostream:39:0,
                 from /home/mainuser/softwares/occt-0be1173/include/opencascade/Standard_Stream.hxx:20,
                 from /home/mainuser/softwares/occt-0be1173/include/opencascade/Standard_OStream.hxx:19,
                 from /home/mainuser/softwares/occt-0be1173/include/opencascade/Standard_ExtCharacter.hxx:28,
                 from /home/mainuser/softwares/occt-0be1173/include/opencascade/Standard_PrimitiveTypes.hxx:27,
                 from /home/mainuser/softwares/occt-0be1173/include/opencascade/Standard_Transient.hxx:20,
                 from /home/mainuser/softwares/occt-0be1173/include/opencascade/Standard.hxx:91,
                 from /home/mainuser/softwares/occt-0be1173/include/opencascade/BRepBuilderAPI_MakeEdge2d.hxx:20,
                 from /home/mainuser/softwares/freecad_source/src/Mod/Part/App/Geometry2d.cpp:26:
/usr/include/c++/6/ostream:590:5: note:   ‘std::endl’
     endl(basic_ostream<_CharT, _Traits>& __os)
     ^~~~
/usr/include/c++/6/ostream:590:5: note:   ‘std::endl’
/usr/include/c++/6/ostream:590:5: note:   ‘std::endl’
/home/mainuser/softwares/freecad_source/src/Mod/Part/App/Geometry2d.cpp: In member function ‘virtual void Part::Geom2dArcOfEllipse::Save(Base::Writer&) const’:
/home/mainuser/softwares/freecad_source/src/Mod/Part/App/Geometry2d.cpp:1332:20: error: ‘endl’ was not declared in this scope
         << "/>" << endl;
                    ^~~~
/home/mainuser/softwares/freecad_source/src/Mod/Part/App/Geometry2d.cpp:1332:20: note: suggested alternatives:
In file included from /usr/include/c++/6/iostream:39:0,
                 from /home/mainuser/softwares/occt-0be1173/include/opencascade/Standard_Stream.hxx:20,
                 from /home/mainuser/softwares/occt-0be1173/include/opencascade/Standard_OStream.hxx:19,
                 from /home/mainuser/softwares/occt-0be1173/include/opencascade/Standard_ExtCharacter.hxx:28,
                 from /home/mainuser/softwares/occt-0be1173/include/opencascade/Standard_PrimitiveTypes.hxx:27,
                 from /home/mainuser/softwares/occt-0be1173/include/opencascade/Standard_Transient.hxx:20,
                 from /home/mainuser/softwares/occt-0be1173/include/opencascade/Standard.hxx:91,
                 from /home/mainuser/softwares/occt-0be1173/include/opencascade/BRepBuilderAPI_MakeEdge2d.hxx:20,
                 from /home/mainuser/softwares/freecad_source/src/Mod/Part/App/Geometry2d.cpp:26:
/usr/include/c++/6/ostream:590:5: note:   ‘std::endl’
     endl(basic_ostream<_CharT, _Traits>& __os)
     ^~~~
/usr/include/c++/6/ostream:590:5: note:   ‘std::endl’
/usr/include/c++/6/ostream:590:5: note:   ‘std::endl’
/home/mainuser/softwares/freecad_source/src/Mod/Part/App/Geometry2d.cpp: In member function ‘virtual void Part::Geom2dHyperbola::Save(Base::Writer&) const’:
/home/mainuser/softwares/freecad_source/src/Mod/Part/App/Geometry2d.cpp:1461:20: error: ‘endl’ was not declared in this scope
         << "/>" << endl;
                    ^~~~
/home/mainuser/softwares/freecad_source/src/Mod/Part/App/Geometry2d.cpp:1461:20: note: suggested alternatives:
In file included from /usr/include/c++/6/iostream:39:0,
                 from /home/mainuser/softwares/occt-0be1173/include/opencascade/Standard_Stream.hxx:20,
                 from /home/mainuser/softwares/occt-0be1173/include/opencascade/Standard_OStream.hxx:19,
                 from /home/mainuser/softwares/occt-0be1173/include/opencascade/Standard_ExtCharacter.hxx:28,
                 from /home/mainuser/softwares/occt-0be1173/include/opencascade/Standard_PrimitiveTypes.hxx:27,
                 from /home/mainuser/softwares/occt-0be1173/include/opencascade/Standard_Transient.hxx:20,
                 from /home/mainuser/softwares/occt-0be1173/include/opencascade/Standard.hxx:91,
                 from /home/mainuser/softwares/occt-0be1173/include/opencascade/BRepBuilderAPI_MakeEdge2d.hxx:20,
                 from /home/mainuser/softwares/freecad_source/src/Mod/Part/App/Geometry2d.cpp:26:
/usr/include/c++/6/ostream:590:5: note:   ‘std::endl’
     endl(basic_ostream<_CharT, _Traits>& __os)
     ^~~~
/usr/include/c++/6/ostream:590:5: note:   ‘std::endl’
/usr/include/c++/6/ostream:590:5: note:   ‘std::endl’
/home/mainuser/softwares/freecad_source/src/Mod/Part/App/Geometry2d.cpp: In member function ‘virtual void Part::Geom2dArcOfHyperbola::Save(Base::Writer&) const’:
/home/mainuser/softwares/freecad_source/src/Mod/Part/App/Geometry2d.cpp:1594:20: error: ‘endl’ was not declared in this scope
         << "/>" << endl;
                    ^~~~
/home/mainuser/softwares/freecad_source/src/Mod/Part/App/Geometry2d.cpp:1594:20: note: suggested alternatives:
In file included from /usr/include/c++/6/iostream:39:0,
                 from /home/mainuser/softwares/occt-0be1173/include/opencascade/Standard_Stream.hxx:20,
                 from /home/mainuser/softwares/occt-0be1173/include/opencascade/Standard_OStream.hxx:19,
                 from /home/mainuser/softwares/occt-0be1173/include/opencascade/Standard_ExtCharacter.hxx:28,
                 from /home/mainuser/softwares/occt-0be1173/include/opencascade/Standard_PrimitiveTypes.hxx:27,
                 from /home/mainuser/softwares/occt-0be1173/include/opencascade/Standard_Transient.hxx:20,
                 from /home/mainuser/softwares/occt-0be1173/include/opencascade/Standard.hxx:91,
                 from /home/mainuser/softwares/occt-0be1173/include/opencascade/BRepBuilderAPI_MakeEdge2d.hxx:20,
                 from /home/mainuser/softwares/freecad_source/src/Mod/Part/App/Geometry2d.cpp:26:
/usr/include/c++/6/ostream:590:5: note:   ‘std::endl’
     endl(basic_ostream<_CharT, _Traits>& __os)
     ^~~~
/usr/include/c++/6/ostream:590:5: note:   ‘std::endl’
/usr/include/c++/6/ostream:590:5: note:   ‘std::endl’
/home/mainuser/softwares/freecad_source/src/Mod/Part/App/Geometry2d.cpp: In member function ‘virtual void Part::Geom2dParabola::Save(Base::Writer&) const’:
/home/mainuser/softwares/freecad_source/src/Mod/Part/App/Geometry2d.cpp:1705:20: error: ‘endl’ was not declared in this scope
         << "/>" << endl;
                    ^~~~
/home/mainuser/softwares/freecad_source/src/Mod/Part/App/Geometry2d.cpp:1705:20: note: suggested alternatives:
In file included from /usr/include/c++/6/iostream:39:0,
                 from /home/mainuser/softwares/occt-0be1173/include/opencascade/Standard_Stream.hxx:20,
                 from /home/mainuser/softwares/occt-0be1173/include/opencascade/Standard_OStream.hxx:19,
                 from /home/mainuser/softwares/occt-0be1173/include/opencascade/Standard_ExtCharacter.hxx:28,
                 from /home/mainuser/softwares/occt-0be1173/include/opencascade/Standard_PrimitiveTypes.hxx:27,
                 from /home/mainuser/softwares/occt-0be1173/include/opencascade/Standard_Transient.hxx:20,
                 from /home/mainuser/softwares/occt-0be1173/include/opencascade/Standard.hxx:91,
                 from /home/mainuser/softwares/occt-0be1173/include/opencascade/BRepBuilderAPI_MakeEdge2d.hxx:20,
                 from /home/mainuser/softwares/freecad_source/src/Mod/Part/App/Geometry2d.cpp:26:
/usr/include/c++/6/ostream:590:5: note:   ‘std::endl’
     endl(basic_ostream<_CharT, _Traits>& __os)
     ^~~~
/usr/include/c++/6/ostream:590:5: note:   ‘std::endl’
/usr/include/c++/6/ostream:590:5: note:   ‘std::endl’
/home/mainuser/softwares/freecad_source/src/Mod/Part/App/Geometry2d.cpp: In member function ‘virtual void Part::Geom2dArcOfParabola::Save(Base::Writer&) const’:
/home/mainuser/softwares/freecad_source/src/Mod/Part/App/Geometry2d.cpp:1818:20: error: ‘endl’ was not declared in this scope
         << "/>" << endl;
                    ^~~~
/home/mainuser/softwares/freecad_source/src/Mod/Part/App/Geometry2d.cpp:1818:20: note: suggested alternatives:
In file included from /usr/include/c++/6/iostream:39:0,
                 from /home/mainuser/softwares/occt-0be1173/include/opencascade/Standard_Stream.hxx:20,
                 from /home/mainuser/softwares/occt-0be1173/include/opencascade/Standard_OStream.hxx:19,
                 from /home/mainuser/softwares/occt-0be1173/include/opencascade/Standard_ExtCharacter.hxx:28,
                 from /home/mainuser/softwares/occt-0be1173/include/opencascade/Standard_PrimitiveTypes.hxx:27,
                 from /home/mainuser/softwares/occt-0be1173/include/opencascade/Standard_Transient.hxx:20,
                 from /home/mainuser/softwares/occt-0be1173/include/opencascade/Standard.hxx:91,
                 from /home/mainuser/softwares/occt-0be1173/include/opencascade/BRepBuilderAPI_MakeEdge2d.hxx:20,
                 from /home/mainuser/softwares/freecad_source/src/Mod/Part/App/Geometry2d.cpp:26:
/usr/include/c++/6/ostream:590:5: note:   ‘std::endl’
     endl(basic_ostream<_CharT, _Traits>& __os)
     ^~~~
/usr/include/c++/6/ostream:590:5: note:   ‘std::endl’
/usr/include/c++/6/ostream:590:5: note:   ‘std::endl’
/home/mainuser/softwares/freecad_source/src/Mod/Part/App/Geometry2d.cpp: In member function ‘virtual void Part::Geom2dLine::Save(Base::Writer&) const’:
/home/mainuser/softwares/freecad_source/src/Mod/Part/App/Geometry2d.cpp:1933:20: error: ‘endl’ was not declared in this scope
         << "/>" << endl;
                    ^~~~
/home/mainuser/softwares/freecad_source/src/Mod/Part/App/Geometry2d.cpp:1933:20: note: suggested alternatives:
In file included from /usr/include/c++/6/iostream:39:0,
                 from /home/mainuser/softwares/occt-0be1173/include/opencascade/Standard_Stream.hxx:20,
                 from /home/mainuser/softwares/occt-0be1173/include/opencascade/Standard_OStream.hxx:19,
                 from /home/mainuser/softwares/occt-0be1173/include/opencascade/Standard_ExtCharacter.hxx:28,
                 from /home/mainuser/softwares/occt-0be1173/include/opencascade/Standard_PrimitiveTypes.hxx:27,
                 from /home/mainuser/softwares/occt-0be1173/include/opencascade/Standard_Transient.hxx:20,
                 from /home/mainuser/softwares/occt-0be1173/include/opencascade/Standard.hxx:91,
                 from /home/mainuser/softwares/occt-0be1173/include/opencascade/BRepBuilderAPI_MakeEdge2d.hxx:20,
                 from /home/mainuser/softwares/freecad_source/src/Mod/Part/App/Geometry2d.cpp:26:
/usr/include/c++/6/ostream:590:5: note:   ‘std::endl’
     endl(basic_ostream<_CharT, _Traits>& __os)
     ^~~~
/usr/include/c++/6/ostream:590:5: note:   ‘std::endl’
/usr/include/c++/6/ostream:590:5: note:   ‘std::endl’
/home/mainuser/softwares/freecad_source/src/Mod/Part/App/Geometry2d.cpp: In member function ‘virtual void Part::Geom2dLineSegment::Save(Base::Writer&) const’:
/home/mainuser/softwares/freecad_source/src/Mod/Part/App/Geometry2d.cpp:2067:20: error: ‘endl’ was not declared in this scope
         << "/>" << endl;
                    ^~~~
/home/mainuser/softwares/freecad_source/src/Mod/Part/App/Geometry2d.cpp:2067:20: note: suggested alternatives:
In file included from /usr/include/c++/6/iostream:39:0,
                 from /home/mainuser/softwares/occt-0be1173/include/opencascade/Standard_Stream.hxx:20,
                 from /home/mainuser/softwares/occt-0be1173/include/opencascade/Standard_OStream.hxx:19,
                 from /home/mainuser/softwares/occt-0be1173/include/opencascade/Standard_ExtCharacter.hxx:28,
                 from /home/mainuser/softwares/occt-0be1173/include/opencascade/Standard_PrimitiveTypes.hxx:27,
                 from /home/mainuser/softwares/occt-0be1173/include/opencascade/Standard_Transient.hxx:20,
                 from /home/mainuser/softwares/occt-0be1173/include/opencascade/Standard.hxx:91,
                 from /home/mainuser/softwares/occt-0be1173/include/opencascade/BRepBuilderAPI_MakeEdge2d.hxx:20,
                 from /home/mainuser/softwares/freecad_source/src/Mod/Part/App/Geometry2d.cpp:26:
/usr/include/c++/6/ostream:590:5: note:   ‘std::endl’
     endl(basic_ostream<_CharT, _Traits>& __os)
     ^~~~
/usr/include/c++/6/ostream:590:5: note:   ‘std::endl’
/usr/include/c++/6/ostream:590:5: note:   ‘std::endl’
src/Mod/Part/App/CMakeFiles/Part.dir/build.make:3437 : la recette pour la cible « src/Mod/Part/App/CMakeFiles/Part.dir/Geometry2d.cpp.o » a échouée
make[2]: *** [src/Mod/Part/App/CMakeFiles/Part.dir/Geometry2d.cpp.o] Erreur 1
CMakeFiles/Makefile2:1877 : la recette pour la cible « src/Mod/Part/App/CMakeFiles/Part.dir/all » a échouée
make[1]: *** [src/Mod/Part/App/CMakeFiles/Part.dir/all] Erreur 2
Makefile:127 : la recette pour la cible « all » a échouée
make: *** [all] Erreur 2
wmayer
Site Admin
Posts: 15756
Joined: Thu Feb 19, 2009 10:32 am

Re: Compilation fails on Debian.

Postby wmayer » Wed Aug 21, 2019 9:58 pm

Next.
fcaduser
Posts: 281
Joined: Wed Feb 19, 2014 6:53 pm
Location: Near Paris, France

Re: Compilation fails on Debian.

Postby fcaduser » Wed Aug 21, 2019 10:04 pm

Testing...
Jee-Bee
Posts: 2012
Joined: Tue Jun 16, 2015 10:32 am
Location: Netherlands

Re: Compilation fails on Debian.

Postby Jee-Bee » Thu Aug 22, 2019 6:56 am

fcaduser wrote:
Wed Aug 21, 2019 8:08 pm
OK. I thought code was for insert *.{cpp,py,h, ... }
nope basically for all large amount of text specially where indentation matters. works realy well with terminator in/ output :)
fcaduser
Posts: 281
Joined: Wed Feb 19, 2014 6:53 pm
Location: Near Paris, France

Re: Compilation fails on Debian.

Postby fcaduser » Thu Aug 22, 2019 12:14 pm

Success ! Thank you for your help.